Visit Our UNIX and Linux User Community


Globus toolkit WS Gram Build Problem


 
Thread Tools Search this Thread
Top Forums UNIX for Advanced & Expert Users Globus toolkit WS Gram Build Problem
# 1  
Old 08-07-2009
Globus toolkit WS Gram Build Problem

Dear Sir/Madam

We are trying to configure Grid in our computer lab. We have already installed all the required software for configuring the grid. At present we are configuring it for 3 nodes. We are using Fedora 8 OS.

We are using Sun Grid Engine (SGE) and Globus Tool Kit for configuring the grid. In final stage we need to download and configure four source files for the WS GRAM SGE jobmanager that need to be downloaded and built as user 'globus' on one node. We have downloaded the files but not able to build these two files.

globus_scheduler_event_generator_sge_setup-1.1.tar.gz

we are getting the following error while building the above mentioned file.

-------------------------------------------------------------------------------------
gpt-build -force globus_scheduler_event_generator_sge_setup-1.1.tar.gz
gpt-build ====> CHECKING BUILD DEPENDENCIES FOR globus_scheduler_event_generator_sge_setup
gpt-build ====> Changing to /home/globus/BUILD/globus_scheduler_event_generator_sge_setup-1.1/
gpt-build ====> BUILDING globus_scheduler_event_generator_sge_setup
GLOBUS_LOCATION=/opt/globus-4.2.1; export GLOBUS_LOCATION; /usr/bin/make install
Making install in pkgdata
make[1]: Entering directory `/home/globus/BUILD/globus_scheduler_event_generator_sge_setup-1.1/pkgdata'
make[2]: Entering directory `/home/globus/BUILD/globus_scheduler_event_generator_sge_setup-1.1'
Making filelist in pkgdata
make[3]: Entering directory `/home/globus/BUILD/globus_scheduler_event_generator_sge_setup-1.1/pkgdata'
make[4]: Entering directory `/home/globus/BUILD/globus_scheduler_event_generator_sge_setup-1.1/pkgdata'
make[4]: Nothing to be done for `filelist-am'.
make[4]: Leaving directory `/home/globus/BUILD/globus_scheduler_event_generator_sge_setup-1.1/pkgdata'
:
make[3]: Leaving directory `/home/globus/BUILD/globus_scheduler_event_generator_sge_setup-1.1/pkgdata'
Making filelist in doxygen
make[3]: Entering directory `/home/globus/BUILD/globus_scheduler_event_generator_sge_setup-1.1/doxygen'
make[3]: Leaving directory `/home/globus/BUILD/globus_scheduler_event_generator_sge_setup-1.1/doxygen'
make[3]: Entering directory `/home/globus/BUILD/globus_scheduler_event_generator_sge_setup-1.1'
make[3]: Nothing to be done for `filelist-am'.
make[3]: Leaving directory `/home/globus/BUILD/globus_scheduler_event_generator_sge_setup-1.1'
:
make[2]: Leaving directory `/home/globus/BUILD/globus_scheduler_event_generator_sge_setup-1.1'
make[2]: Entering directory `/home/globus/BUILD/globus_scheduler_event_generator_sge_setup-1.1/pkgdata'
make[2]: Nothing to be done for `install-exec-am'.
make[3]: Entering directory `/home/globus/BUILD/globus_scheduler_event_generator_sge_setup-1.1'
Making filelist in pkgdata
make[4]: Entering directory `/home/globus/BUILD/globus_scheduler_event_generator_sge_setup-1.1/pkgdata'
make[5]: Entering directory `/home/globus/BUILD/globus_scheduler_event_generator_sge_setup-1.1/pkgdata'
make[5]: Nothing to be done for `filelist-am'.
make[5]: Leaving directory `/home/globus/BUILD/globus_scheduler_event_generator_sge_setup-1.1/pkgdata'
:
make[4]: Leaving directory `/home/globus/BUILD/globus_scheduler_event_generator_sge_setup-1.1/pkgdata'
Making filelist in doxygen
make[4]: Entering directory `/home/globus/BUILD/globus_scheduler_event_generator_sge_setup-1.1/doxygen'
make[4]: Leaving directory `/home/globus/BUILD/globus_scheduler_event_generator_sge_setup-1.1/doxygen'
make[4]: Entering directory `/home/globus/BUILD/globus_scheduler_event_generator_sge_setup-1.1'
make[4]: Nothing to be done for `filelist-am'.
make[4]: Leaving directory `/home/globus/BUILD/globus_scheduler_event_generator_sge_setup-1.1'
:
make[3]: Leaving directory `/home/globus/BUILD/globus_scheduler_event_generator_sge_setup-1.1'
test -z "/opt/globus-4.2.1/etc/globus_packages/globus_scheduler_event_generator_sge_setup" || mkdir -p -- "/opt/globus-4.2.1/etc/globus_packages/globus_scheduler_event_generator_sge_setup"
/usr/bin/install -c -m 644 '/home/globus/BUILD/globus_scheduler_event_generator_sge_setup-1.1/pkgdata/noflavor_data.filelist' '/opt/globus-4.2.1/etc/globus_packages/globus_scheduler_event_generator_sge_setup/noflavor_data.filelist'
/usr/bin/install: cannot stat `/home/globus/BUILD/globus_scheduler_event_generator_sge_setup-1.1/pkgdata/noflavor_data.filelist': No such file or directory
/usr/bin/install -c -m 644 '/home/globus/BUILD/globus_scheduler_event_generator_sge_setup-1.1/pkgdata/noflavor_dev.filelist' '/opt/globus-4.2.1/etc/globus_packages/globus_scheduler_event_generator_sge_setup/noflavor_dev.filelist'
/usr/bin/install: cannot stat `/home/globus/BUILD/globus_scheduler_event_generator_sge_setup-1.1/pkgdata/noflavor_dev.filelist': No such file or directory
/usr/bin/install -c -m 644 '/home/globus/BUILD/globus_scheduler_event_generator_sge_setup-1.1/pkgdata/noflavor_doc.filelist' '/opt/globus-4.2.1/etc/globus_packages/globus_scheduler_event_generator_sge_setup/noflavor_doc.filelist'
/usr/bin/install: cannot stat `/home/globus/BUILD/globus_scheduler_event_generator_sge_setup-1.1/pkgdata/noflavor_doc.filelist': No such file or directory
/usr/bin/install -c -m 644 'noflavor_pgm.filelist' '/opt/globus-4.2.1/etc/globus_packages/globus_scheduler_event_generator_sge_setup/noflavor_pgm.filelist'
/usr/bin/install -c -m 644 'noflavor_pgm_static.filelist' '/opt/globus-4.2.1/etc/globus_packages/globus_scheduler_event_generator_sge_setup/noflavor_pgm_static.filelist'
/usr/bin/install -c -m 644 '/home/globus/BUILD/globus_scheduler_event_generator_sge_setup-1.1/pkgdata/noflavor_rtl.filelist' '/opt/globus-4.2.1/etc/globus_packages/globus_scheduler_event_generator_sge_setup/noflavor_rtl.filelist'
/usr/bin/install: cannot stat `/home/globus/BUILD/globus_scheduler_event_generator_sge_setup-1.1/pkgdata/noflavor_rtl.filelist': No such file or directory
/usr/bin/install -c -m 644 '/home/globus/BUILD/globus_scheduler_event_generator_sge_setup-1.1/pkgdata/pkg_data_noflavor_data.gpt' '/opt/globus-4.2.1/etc/globus_packages/globus_scheduler_event_generator_sge_setup/pkg_data_noflavor_data.gpt'
/usr/bin/install: cannot stat `/home/globus/BUILD/globus_scheduler_event_generator_sge_setup-1.1/pkgdata/pkg_data_noflavor_data.gpt': No such file or directory
/usr/bin/install -c -m 644 '/home/globus/BUILD/globus_scheduler_event_generator_sge_setup-1.1/pkgdata/pkg_data_noflavor_dev.gpt' '/opt/globus-4.2.1/etc/globus_packages/globus_scheduler_event_generator_sge_setup/pkg_data_noflavor_dev.gpt'
/usr/bin/install: cannot stat `/home/globus/BUILD/globus_scheduler_event_generator_sge_setup-1.1/pkgdata/pkg_data_noflavor_dev.gpt': No such file or directory
/usr/bin/install -c -m 644 '/home/globus/BUILD/globus_scheduler_event_generator_sge_setup-1.1/pkgdata/pkg_data_noflavor_doc.gpt' '/opt/globus-4.2.1/etc/globus_packages/globus_scheduler_event_generator_sge_setup/pkg_data_noflavor_doc.gpt'
/usr/bin/install: cannot stat `/home/globus/BUILD/globus_scheduler_event_generator_sge_setup-1.1/pkgdata/pkg_data_noflavor_doc.gpt': No such file or directory
/usr/bin/install -c -m 644 'pkg_data_noflavor_pgm.gpt' '/opt/globus-4.2.1/etc/globus_packages/globus_scheduler_event_generator_sge_setup/pkg_data_noflavor_pgm.gpt'
/usr/bin/install -c -m 644 'pkg_data_noflavor_pgm_static.gpt' '/opt/globus-4.2.1/etc/globus_packages/globus_scheduler_event_generator_sge_setup/pkg_data_noflavor_pgm_static.gpt'
/usr/bin/install -c -m 644 '/home/globus/BUILD/globus_scheduler_event_generator_sge_setup-1.1/pkgdata/pkg_data_noflavor_rtl.gpt' '/opt/globus-4.2.1/etc/globus_packages/globus_scheduler_event_generator_sge_setup/pkg_data_noflavor_rtl.gpt'
/usr/bin/install: cannot stat `/home/globus/BUILD/globus_scheduler_event_generator_sge_setup-1.1/pkgdata/pkg_data_noflavor_rtl.gpt': No such file or directory
make[2]: *** [install-pkgDATA] Error 1
make[2]: Leaving directory `/home/globus/BUILD/globus_scheduler_event_generator_sge_setup-1.1/pkgdata'
make[1]: *** [install-am] Error 2
make[1]: Leaving directory `/home/globus/BUILD/globus_scheduler_event_generator_sge_setup-1.1/pkgdata'
make: *** [install-recursive] Error 1
ERROR: Build has failed

-------------------------------------------------------------------------------------

Similarly while building the file “globus_wsrf_gram_service_java_setup_sge-1.1.tar.gz” we are getting following error.

-----------------------------------------------------------------------------------
gpt-build -force ./globus_wsrf_gram_service_java_setup_sge-1.1.tar.gz
gpt-build ====> CHECKING BUILD DEPENDENCIES FOR globus_wsrf_gram_service_java_setup_sge
gpt-build ====> Changing to /home/globus/BUILD/globus_wsrf_gram_service_java_setup_sge-1.1/
gpt-build ====> BUILDING globus_wsrf_gram_service_java_setup_sge
GLOBUS_LOCATION=/opt/globus-4.2.1; export GLOBUS_LOCATION; /usr/bin/make install
Making install in pkgdata
make[1]: Entering directory `/home/globus/BUILD/globus_wsrf_gram_service_java_setup_sge-1.1/pkgdata'
make[2]: Entering directory `/home/globus/BUILD/globus_wsrf_gram_service_java_setup_sge-1.1'
Making filelist in pkgdata
make[3]: Entering directory `/home/globus/BUILD/globus_wsrf_gram_service_java_setup_sge-1.1/pkgdata'
make[4]: Entering directory `/home/globus/BUILD/globus_wsrf_gram_service_java_setup_sge-1.1/pkgdata'
make[4]: Nothing to be done for `filelist-am'.
make[4]: Leaving directory `/home/globus/BUILD/globus_wsrf_gram_service_java_setup_sge-1.1/pkgdata'
:
make[3]: Leaving directory `/home/globus/BUILD/globus_wsrf_gram_service_java_setup_sge-1.1/pkgdata'
Making filelist in doxygen
make[3]: Entering directory `/home/globus/BUILD/globus_wsrf_gram_service_java_setup_sge-1.1/doxygen'
make[3]: Leaving directory `/home/globus/BUILD/globus_wsrf_gram_service_java_setup_sge-1.1/doxygen'
make[3]: Entering directory `/home/globus/BUILD/globus_wsrf_gram_service_java_setup_sge-1.1'
make[3]: Nothing to be done for `filelist-am'.
make[3]: Leaving directory `/home/globus/BUILD/globus_wsrf_gram_service_java_setup_sge-1.1'
:
make[2]: Leaving directory `/home/globus/BUILD/globus_wsrf_gram_service_java_setup_sge-1.1'
make[2]: Entering directory `/home/globus/BUILD/globus_wsrf_gram_service_java_setup_sge-1.1/pkgdata'
make[2]: Nothing to be done for `install-exec-am'.
make[3]: Entering directory `/home/globus/BUILD/globus_wsrf_gram_service_java_setup_sge-1.1'
Making filelist in pkgdata
make[4]: Entering directory `/home/globus/BUILD/globus_wsrf_gram_service_java_setup_sge-1.1/pkgdata'
make[5]: Entering directory `/home/globus/BUILD/globus_wsrf_gram_service_java_setup_sge-1.1/pkgdata'
make[5]: Nothing to be done for `filelist-am'.
make[5]: Leaving directory `/home/globus/BUILD/globus_wsrf_gram_service_java_setup_sge-1.1/pkgdata'
:
make[4]: Leaving directory `/home/globus/BUILD/globus_wsrf_gram_service_java_setup_sge-1.1/pkgdata'
Making filelist in doxygen
make[4]: Entering directory `/home/globus/BUILD/globus_wsrf_gram_service_java_setup_sge-1.1/doxygen'
make[4]: Leaving directory `/home/globus/BUILD/globus_wsrf_gram_service_java_setup_sge-1.1/doxygen'
make[4]: Entering directory `/home/globus/BUILD/globus_wsrf_gram_service_java_setup_sge-1.1'
make[4]: Nothing to be done for `filelist-am'.
make[4]: Leaving directory `/home/globus/BUILD/globus_wsrf_gram_service_java_setup_sge-1.1'
:
make[3]: Leaving directory `/home/globus/BUILD/globus_wsrf_gram_service_java_setup_sge-1.1'
test -z "/opt/globus-4.2.1/etc/globus_packages/globus_wsrf_gram_service_java_setup_sge" || mkdir -p -- "/opt/globus-4.2.1/etc/globus_packages/globus_wsrf_gram_service_java_setup_sge"
/usr/bin/install -c -m 644 '/home/globus/BUILD/globus_wsrf_gram_service_java_setup_sge-1.1/pkgdata/noflavor_data.filelist' '/opt/globus-4.2.1/etc/globus_packages/globus_wsrf_gram_service_java_setup_sge/noflavor_data.filelist'
/usr/bin/install: cannot stat `/home/globus/BUILD/globus_wsrf_gram_service_java_setup_sge-1.1/pkgdata/noflavor_data.filelist': No such file or directory
/usr/bin/install -c -m 644 '/home/globus/BUILD/globus_wsrf_gram_service_java_setup_sge-1.1/pkgdata/noflavor_dev.filelist' '/opt/globus-4.2.1/etc/globus_packages/globus_wsrf_gram_service_java_setup_sge/noflavor_dev.filelist'
/usr/bin/install: cannot stat `/home/globus/BUILD/globus_wsrf_gram_service_java_setup_sge-1.1/pkgdata/noflavor_dev.filelist': No such file or directory
/usr/bin/install -c -m 644 '/home/globus/BUILD/globus_wsrf_gram_service_java_setup_sge-1.1/pkgdata/noflavor_doc.filelist' '/opt/globus-4.2.1/etc/globus_packages/globus_wsrf_gram_service_java_setup_sge/noflavor_doc.filelist'
/usr/bin/install: cannot stat `/home/globus/BUILD/globus_wsrf_gram_service_java_setup_sge-1.1/pkgdata/noflavor_doc.filelist': No such file or directory
/usr/bin/install -c -m 644 'noflavor_pgm.filelist' '/opt/globus-4.2.1/etc/globus_packages/globus_wsrf_gram_service_java_setup_sge/noflavor_pgm.filelist'
/usr/bin/install -c -m 644 'noflavor_pgm_static.filelist' '/opt/globus-4.2.1/etc/globus_packages/globus_wsrf_gram_service_java_setup_sge/noflavor_pgm_static.filelist'
/usr/bin/install -c -m 644 '/home/globus/BUILD/globus_wsrf_gram_service_java_setup_sge-1.1/pkgdata/noflavor_rtl.filelist' '/opt/globus-4.2.1/etc/globus_packages/globus_wsrf_gram_service_java_setup_sge/noflavor_rtl.filelist'
/usr/bin/install: cannot stat `/home/globus/BUILD/globus_wsrf_gram_service_java_setup_sge-1.1/pkgdata/noflavor_rtl.filelist': No such file or directory
/usr/bin/install -c -m 644 '/home/globus/BUILD/globus_wsrf_gram_service_java_setup_sge-1.1/pkgdata/pkg_data_noflavor_data.gpt' '/opt/globus-4.2.1/etc/globus_packages/globus_wsrf_gram_service_java_setup_sge/pkg_data_noflavor_data.gpt'
/usr/bin/install: cannot stat `/home/globus/BUILD/globus_wsrf_gram_service_java_setup_sge-1.1/pkgdata/pkg_data_noflavor_data.gpt': No such file or directory
/usr/bin/install -c -m 644 '/home/globus/BUILD/globus_wsrf_gram_service_java_setup_sge-1.1/pkgdata/pkg_data_noflavor_dev.gpt' '/opt/globus-4.2.1/etc/globus_packages/globus_wsrf_gram_service_java_setup_sge/pkg_data_noflavor_dev.gpt'
/usr/bin/install: cannot stat `/home/globus/BUILD/globus_wsrf_gram_service_java_setup_sge-1.1/pkgdata/pkg_data_noflavor_dev.gpt': No such file or directory
/usr/bin/install -c -m 644 '/home/globus/BUILD/globus_wsrf_gram_service_java_setup_sge-1.1/pkgdata/pkg_data_noflavor_doc.gpt' '/opt/globus-4.2.1/etc/globus_packages/globus_wsrf_gram_service_java_setup_sge/pkg_data_noflavor_doc.gpt'
/usr/bin/install: cannot stat `/home/globus/BUILD/globus_wsrf_gram_service_java_setup_sge-1.1/pkgdata/pkg_data_noflavor_doc.gpt': No such file or directory
/usr/bin/install -c -m 644 'pkg_data_noflavor_pgm.gpt' '/opt/globus-4.2.1/etc/globus_packages/globus_wsrf_gram_service_java_setup_sge/pkg_data_noflavor_pgm.gpt'
/usr/bin/install -c -m 644 'pkg_data_noflavor_pgm_static.gpt' '/opt/globus-4.2.1/etc/globus_packages/globus_wsrf_gram_service_java_setup_sge/pkg_data_noflavor_pgm_static.gpt'
/usr/bin/install -c -m 644 '/home/globus/BUILD/globus_wsrf_gram_service_java_setup_sge-1.1/pkgdata/pkg_data_noflavor_rtl.gpt' '/opt/globus-4.2.1/etc/globus_packages/globus_wsrf_gram_service_java_setup_sge/pkg_data_noflavor_rtl.gpt'
/usr/bin/install: cannot stat `/home/globus/BUILD/globus_wsrf_gram_service_java_setup_sge-1.1/pkgdata/pkg_data_noflavor_rtl.gpt': No such file or directory
make[2]: *** [install-pkgDATA] Error 1
make[2]: Leaving directory `/home/globus/BUILD/globus_wsrf_gram_service_java_setup_sge-1.1/pkgdata'
make[1]: *** [install-am] Error 2
make[1]: Leaving directory `/home/globus/BUILD/globus_wsrf_gram_service_java_setup_sge-1.1/pkgdata'
make: *** [install-recursive] Error 1
ERROR: Build has failed



-----------------------------------------------------------------------------------

we struck only for building these two file. Kindly help us to resolve this problem


Thanks in Advance,
Gurudat
M.S.Ramaiah Institute of Technology,
Bangalore,India

Previous Thread | Next Thread
Test Your Knowledge in Computers #487
Difficulty: Easy
A program's entry point is always defined by a main function or method.
True or False?

7 More Discussions You Might Find Interesting

1. Ubuntu

Installation problem in globus toolkit 5.0.1

I have installed globus toolkit 5.0.1 on ubuntu 9. All the packages mentioned in quick start guide, like security, gridftp, gram, myproxy. But i don't know how to start web services in globus 5.0.1. There is no help provided in quick start for this. I need WSRF for making grid data mining... (0 Replies)
Discussion started by: naveencse
0 Replies

2. Ubuntu

Installation problem in globus toolkit 4.0.8

I am installing globus toolkit 4.0.8 on ububtu 9.1. When i build gt4.0.8-all-source.... executing, make | tee installer.log , as mentioned in quick start provided by globus, i got error saying, Following packages are missing, pgm_link-globus_ftp_client-ANY-dev version 5.2 is incompatible with... (0 Replies)
Discussion started by: naveencse
0 Replies

3. Linux

compatiblité fedora 11 and globus toolkit 4.0.1

hello i search if fedora 11 is compatible with Globus Toolkit 4.0.1.thank's (2 Replies)
Discussion started by: spam255
2 Replies

4. HP-UX

problem after server build...

Hi, I have installed HP-UX 11.31 on a rx6600 box. The installation went fine and was completed without any errors. But wheni connect to the server using ssh, it asks for a username, when i enter it, it doesnt prompt for a password: login:username blank-------- All i could see in... (1 Reply)
Discussion started by: sag71155
1 Replies

5. UNIX for Advanced & Expert Users

Problem during build

Hi, When i'm compiling my C files, I'm getting an error saying that the file name i've defined is undeclared. Could someone tell me how to solve this error. I've defined the file name as #define _FILE_CODE_ _XYZ_C_ The error is "_XYZ_C undeclared". Thanks in advance (1 Reply)
Discussion started by: laxmi
1 Replies

6. UNIX for Advanced & Expert Users

Globus Toolkit 4

Hello! I'm trying to install the Globus Toolkit 4 on a Fedora 8 system. The instructions I'm using to do so can be found here: Chapter 1. 4.0.x quickstart I'm at the Certificate Authorities point where I am supposed to sign the certificate though, and I'm having a bit of trouble that... (2 Replies)
Discussion started by: Curtor
2 Replies

7. Linux

globus toolkit installation error

i got this error while installing gt4 on fedora core 3. please help root@localhost gt4.0.6-x86_fc_3-installer]# make | tee installer.log cd gpt && OBJECT_MODE=32 ./build_gpt Can't locate Localize.pm in @INC (@INC contains: ./tools /usr/lib/perl5/5.8.5/i386-linux-thread-multi... (0 Replies)
Discussion started by: tushru2004
0 Replies

Featured Tech Videos