How to solve compiling handbrake errors?

Thread Tools Search this Thread
Operating Systems Linux Red Hat How to solve compiling handbrake errors?
# 1  
Old 12-23-2013
How to solve compiling handbrake errors?

Hello friends,

Am trying to compile and build Handbrake 0.9.9 on my redhat box but getting the below errors.

Same errors when I compile the source from github and also from the official web site.

# uname -a
Linux 2.6.18-274.el5 #1 SMP Fri Jul 8 17:36:59 EDT 2011 x86_64 x86_64 x86_64 GNU/Linux


was successful and most part of

went through. It accessed handbrake site and downloaded required modules without any problem and finally gmake throws the below errors.


libbluray/bluray.c:1062: warning: assignment makes pointer from integer without a cast
gmake[4]: *** [bluray.lo] Error 1
gmake[3]: *** [all-recursive] Error 1
gmake[2]: *** [all-recursive] Error 1
gmake[1]: *** [all] Error 2
gmake: *** [contrib/libbluray/] Error 2

Any help please! TIA
Login or Register to Ask a Question

Previous Thread | Next Thread

9 More Discussions You Might Find Interesting

1. Shell Programming and Scripting

help with recursive handbrake script

I have a batch of mkv video files I would like to transcode to a more compressed format. After spending a significant amount of time experimenting with various parameters I think I have found the handbrake settings that give the best compromise. I now want to construct a simple bash script... (4 Replies)
Discussion started by: jonesal2
4 Replies

2. OS X (Apple)

FFMPEG install on 10.4.11, errors compiling and also using port

i've got an older white macbook running 10.4.11. about 5 years old i think. trying to install ffmpeg in 2 different ways. having errors on both. first tried this one: ffmpeg installation on Mac OSX and i got this error when i got down to "make" on the ffmpeg itself make(350) malloc: ***... (1 Reply)
Discussion started by: danpaluska
1 Replies

3. UNIX for Dummies Questions & Answers

Custom kernel compiling, won't boot, and errors.

First of all, I'd like to preface this post by relaying that I have considerable experience with FreeBSD but I'm a Linux newb. I've been attempting to compile linux- from source and I'm having some problems and have a few newb questions... a) First of all, my kernel won't boot, it fails... (0 Replies)
Discussion started by: urbanriot
0 Replies

4. Solaris

Errors compiling Bind

Hi all, Apologies if this is the wrong forum for this question, if it is, could some one point me to the right one please. I am trying to compile bind-9.5.1b1 on Solaris 10 Get the error when try to configure: checking for OpenSSL library... using OpenSSL from /usr/local/lib and... (5 Replies)
Discussion started by: callmebob
5 Replies

5. Solaris

How to solve "ioscan -En" hardware errors

Hi, I found devices errors in #ioscan -En. it is showing that soft errors = 0 and hard errors= 5. what should i do for hard errors=0. Thanks. (4 Replies)
Discussion started by: arjunreddy3
4 Replies

6. HP-UX

errors while compiling c++ module

hello everyone, here i attempting to compile a c++ module . I am using the following command make -d dummyCHARGP. i am using the gcc compiler .my os is HP-UX 11.11. here i am getting the following errors. errors: ======= /swtemp/usbs/cc/unix-ce/root/subsys/include/main.h:146:... (1 Reply)
Discussion started by: mannam srinivas
1 Replies

7. UNIX for Dummies Questions & Answers

errors compiling gcc 4.2.1

Hello, I have never had a successful compile on the 2.6 kernel. On every arch in which I try to compile gcc I get either "i686-pc-cygwin-ar command not found or "i686-suse-linux-ar command not found. This always happens during the make process after configure checks for ar and finds it's just ar.... (2 Replies)
Discussion started by: kwa71
2 Replies

8. Programming

Errors while Compiling a PC script.

Hi all, I have created a post-C (PC) script OrdItmpopulate.pc. When I am compiling this using the “Make” command I am getting the following error. My “make” command looks like this: make -f $ORACLE_HOME/precomp/demo/proc/ build EXE=OrdItmpopulate8.exe OBJS="OrdItmpopulate8.o"... (1 Reply)
Discussion started by: musavir19
1 Replies

9. Programming

Compiling Errors -- Symbol referencing

I'm trying to compile a FTP_API program. To do this you must use the libary. But that libary has references which are not defined. Has anyone had this problems and how is it corrected?? The command line looks like this:-------------------------------------------- # cc ftpstock.c -lftp... (5 Replies)
Discussion started by: spotanddot
5 Replies
Login or Register to Ask a Question