Visit Our UNIX and Linux User Community


error: rw/regexp.h: No such file or directory


 
Thread Tools Search this Thread
Operating Systems Linux error: rw/regexp.h: No such file or directory
# 1  
Old 07-30-2008
Bug error: rw/regexp.h: No such file or directory

Hello every one,

i am trying to compile c++ modules.

while compiling a module i am getting the following error.

cdbh_RecordStore.C:32:23: error: rw/regexp.h: No such file or directory
make: *** [/root/cc/unix-ce/root/subsys/cb/cdbh/obj_cdbRS/Linux//cdbh_RecordStore.dep] Error 1

I googled for the solution , i found that this is a Rogue wave class.

actually this file got included in a source file .

can somebody suggest how to solve this error.


kind regards,
mannam srinivas

Previous Thread | Next Thread
Test Your Knowledge in Computers #506
Difficulty: Easy
A flowchart is a visual representation of an algorithm or process consisting of boxes or 'nodes' connected by directed edges.
True or False?

10 More Discussions You Might Find Interesting

1. Shell Programming and Scripting

No such file or directory error

I am new to shell scripting so I assume there is something basic I am missing but I have not been able to figure it out. When I run the following code from a script it can't find the paths to the directory or files. I can literally cut and paste the commands into terminal and they work fine. Why... (2 Replies)
Discussion started by: TryAgain12
2 Replies

2. Shell Programming and Scripting

No Such File or Directory error

Hi! I just recently started messing around with Unix, but I've come upon one problem multiple times. Whenever I try to run a shell script, for example; #! /bin/bash #-------------------------------------- # example1 #-------------------------------------- echo "Hello, World!" I... (5 Replies)
Discussion started by: SoapilyProne
5 Replies

3. Solaris

/bin/find: stat() error <File> : No such file or directory

Hi, I am getting below error in Solaris 10 SPARC when trying to issue a search on /var/tmp partition Below is the query /bin/find /var/tmp/ -type f -atime +1 Below is the result /bin/find: stat() error <File> : No such file or directory (28 Replies)
Discussion started by: prash358
28 Replies

4. Shell Programming and Scripting

No such file or directory error

Hi, After executing load_data.sh script , it completes the steps in script but give following error.Please let me know how to fix it. ./load_data.sh: ' missing ./load_data.sh: 0: not found for i in 1 2 3 do ###some processing#### DLOG=$( eval echo \${TXPCY_${i}_DATA_FILE_LOG} )... (4 Replies)
Discussion started by: sandy162
4 Replies

5. Shell Programming and Scripting

Error : No such file or directory

Hi, I have issued the below command to remove directories under a specific path, it removes them fine. But atlast it tries to find the same directory and fails. Directories: /root/app/dir /root/app/dir/files/ /root/app/dir/backup/ /root/app/dir/archive/ Command: find... (1 Reply)
Discussion started by: vel4ever
1 Replies

6. Shell Programming and Scripting

awk, sed or perl regexp to print values from file

Hello all According to the following file (orignal one contains 200x times the same structure...) I was wondering if someone could help me to print <byte>??</byte> values example, running this script/command like ./script.sh xxapp I would expect as output: 102 116 112 ./script.sh xxapp2... (2 Replies)
Discussion started by: cabrao
2 Replies

7. UNIX for Dummies Questions & Answers

Error: GL/glut.h: No such file or directory

hi, I get this error when I compile my source on mac Leopard. is because I need to configure openGL path ? Monitor.h:15:60: error: GL/glut.h: No such file or directory Monitor.h:16:60: error: GL/gl.h: No such file or directory Monitor.C: In function 'void display2()': Monitor.C:77:... (0 Replies)
Discussion started by: aneuryzma
0 Replies

8. UNIX for Dummies Questions & Answers

print the line immediately after a regexp; but regexp is a sentence

Good Day, Im new to scripting especially awk and sed. I just would like to ask help from you guys about a sed command that prints the line immediately after a regexp, but not the line containing the regexp. sed -n '/regexp/{n;p;}' filename What if my regexp is 3 word or a sentence. Im... (3 Replies)
Discussion started by: ownins
3 Replies

9. UNIX for Dummies Questions & Answers

SFTP error: no such file or directory

Hi All, I am using a shell script for SFTPing the files to target server. The problem which I am facing is that even if the files are not transferred, the script finishes successfully. I want the script to fail in case the remote directory does not exists. The script which I am using is as... (1 Reply)
Discussion started by: shalini@@@
1 Replies

10. Shell Programming and Scripting

perl regexp error , I cant understand what is wrong

perl regexp error , I cant understand what is wrong Hello all I have simple perl regexp that is searching for pattern in string and replace it with the same string + addition string here is what I have : my $rec = q| new Array("Attributes Management" ... (4 Replies)
Discussion started by: umen
4 Replies
KDE-BUILD(1)						User Contributed Perl Documentation					      KDE-BUILD(1)

NAME
kde-build - Updates and recompiles a tree of KDE CVS modules SYNOPSIS
kde-build DESCRIPTION
kde-build has been designed to keep a local copy of several KDE CVS modules up to date and recompile them. Those modules have to be saved in a common directory, e.g. something like ~/kde-src/ | +-> kdelibs/ | +-> kdebase/ | -> kdenetwork/ In this case, the KDE source directory would be ~/kde-src/. The script will take care of compiling them in the correct order, checks for dependencies and resolves them as far as possible. Please not that, prior to first invokation of the script, the configuration file 'kde-buildrc' has to be modified to reflect the local environment, such as paths etc. RETURN VALUE
The following error codes are returned by the script. 0 - No error seems to have occured. 1 - The script could not change into the directory of a module. 2 - The script could not open the file 'Makefile.in' of a module. 3 - The configuration of a module failed. 4 - The compilation of a module failed. 5 - The installation of a module failed. 6 - An invalid source directory was specified. 7 - An invalid Qt directory was specified. 8 - An invalid CVS client was specified. 9 - No cvsup server was specified. 10 - The temporary CVSUP configuration file couldn't be created. 11 - The configuration file kde-buildrc couldn't be loaded. EXAMPLES
cd ~/scripts/; vi ./kde-buildrc; ./kde-build BUGS
Lots, mostly that the script wasn't written with portability in mind and therefore won't run very nice on platforms other than Linux. TODO
Add a DIAGNOSIS section to this man page. AUTHOR
Frerich Raabe <raabe@kde.org> 3rd Berkeley Distribution perl v5.6.1 KDE-BUILD(1)

Featured Tech Videos